BDBM50256896 9-(sec-Butyl)-9H-adenine::CHEMBL466044
SMILES CCC(C)n1cnc2c(N)ncnc12
InChI Key InChIKey=WUUGZXPFGNZPJO-UHFFFAOYSA-N
Data  4 KI
  Tab Delimited (TSV)   2D SDfile   Computed 3D by Vconf -m prep SDfile
Find this compound or compounds like it in BindingDB:
Activity Spreadsheet -- Enzyme Inhibition Constant Data from BindingDB
Found 4 hits for monomerid = 50256896
TargetAdenosine receptor A2a(Homo sapiens (Human))
University Of Camerino
Curated by ChEMBL
LigandPNGBDBM50256896(9-(sec-Butyl)-9H-adenine | CHEMBL466044)
Affinity DataKi:  1.60E+4nM. Assay description: Displacement of [3H]NECA from human adenosine A2A receptor expressed in CHO cells
In DepthDetails ArticlePubMed
TargetAdenosine receptor A2b(Homo sapiens (Human))
University Of Camerino
Curated by ChEMBL
LigandPNGBDBM50256896(9-(sec-Butyl)-9H-adenine | CHEMBL466044)
Affinity DataKi:  1.90E+4nM. Assay description: Antagonist activity at human adenosine A2B receptor expressed in CHO cells assessed as inhibition of NECA-stimulated adenylyl cyclase activity
In DepthDetails ArticlePubMed
TargetAdenosine receptor A1(Homo sapiens (Human))
University Of Camerino
Curated by ChEMBL
LigandPNGBDBM50256896(9-(sec-Butyl)-9H-adenine | CHEMBL466044)
Affinity DataKi:  3.40E+4nM. Assay description: Displacement of [3H]CCPA from human adenosine A1 receptor expressed in CHO cells
In DepthDetails ArticlePubMed
TargetAdenosine receptor A3(Homo sapiens (Human))
University Of Camerino
Curated by ChEMBL
LigandPNGBDBM50256896(9-(sec-Butyl)-9H-adenine | CHEMBL466044)
Affinity DataKi: >1.00E+5nM. Assay description: Displacement of [3H]NECA from human adenosine A3 receptor expressed in CHO cells
In DepthDetails ArticlePubMed