BDBM50258675 CHEMBL468506::[4-(2,3,4,5-Tetrahydro-1,3-dimethyl-2,4-dioxo-1H-pyrrolo[3,2-d]pyrimidin-6-yl)phenyl]methyl furan-2-ylcarbamate
SMILES Cn1c2cc([nH]c2c(=O)n(C)c1=O)-c1ccc(COC(=O)Nc2ccco2)cc1
InChI Key InChIKey=DHQDIUVNRWLRII-UHFFFAOYSA-N
Data  2 KI
  Tab Delimited (TSV)   2D SDfile   Computed 3D by Vconf -m prep SDfile
Find this compound or compounds like it in BindingDB:
Activity Spreadsheet -- Enzyme Inhibition Constant Data from BindingDB
Found 2 hits for monomerid = 50258675
TargetAdenosine receptor A2b(Homo sapiens (Human))
Universidade De Santiago De Compostela
Curated by ChEMBL
LigandPNGBDBM50258675(CHEMBL468506 | [4-(2,3,4,5-Tetrahydro-1,3-dimethyl...)
Affinity DataKi:  3.20nM. Assay description: Displacement of [3H]DPCPX from human recombinant adenosine A2B receptor expressed in HEK293 cells by beta scintillation counter
In DepthDetails ArticlePubMed
TargetAdenosine receptor A2a(Homo sapiens (Human))
Universidade De Santiago De Compostela
Curated by ChEMBL
LigandPNGBDBM50258675(CHEMBL468506 | [4-(2,3,4,5-Tetrahydro-1,3-dimethyl...)
Affinity DataKi:  18.2nM. Assay description: Displacement of [3H]ZM241385 from human recombinant adenosine A2A receptor expressed in HeLa cells by beta scintillation counter
In DepthDetails ArticlePubMed