BDBM50259014 8-((2-chloro-4-methylphenyl)(2-chlorophenyl)methyl)-3-(4-methylpyridin-2-yl)-8-azabicyclo[3.2.1]octan-3-ol::CHEMBL466126
SMILES Cc1ccnc(c1)C1(O)CC2CCC(C1)N2C(c1ccccc1Cl)c1ccc(C)cc1Cl
InChI Key InChIKey=VAZISNGVORVHPA-UHFFFAOYSA-N
Data  2 KI
  Tab Delimited (TSV)   2D SDfile   Computed 3D by Vconf -m prep SDfile
Find this compound or compounds like it in BindingDB:
Activity Spreadsheet -- Enzyme Inhibition Constant Data from BindingDB
Found 2 hits for monomerid = 50259014
TargetNociceptin receptor(Homo sapiens (Human))
Schering-Plough Research Institute
Curated by ChEMBL
LigandPNGBDBM50259014(8-((2-chloro-4-methylphenyl)(2-chlorophenyl)methyl...)
Affinity DataKi:  7.30nM. Assay description: Displacement of [125I][Tyr14]nociceptin from human cloned NOP receptor expressed in CHO cells
In DepthDetails ArticlePubMed
TargetMu-type opioid receptor(Homo sapiens (Human))
Schering-Plough Research Institute
Curated by ChEMBL
LigandPNGBDBM50259014(8-((2-chloro-4-methylphenyl)(2-chlorophenyl)methyl...)
Affinity DataKi:  708nM. Assay description: Displacement of [3H]diprenorphine from human mu opioid receptor expressed in CHO cells
In DepthDetails ArticlePubMed