BDBM50259312 CHEMBL4082842
SMILES O=C(Nc1nc(cn2cc(nc12)-c1ccccc1)-c1ccccc1)c1cccs1
InChI Key InChIKey=NGCYWJLJMSTZKR-UHFFFAOYSA-N
Data  1 KI
  Tab Delimited (TSV)   2D SDfile   Computed 3D by Vconf -m prep SDfile
Find this compound or compounds like it in BindingDB:
Activity Spreadsheet -- Enzyme Inhibition Constant Data from BindingDB
Found 1 hit for monomerid = 50259312
TargetTransmembrane domain-containing protein TMIGD3(Homo sapiens (Human))
Universita Degli Studi Di Firenze
Curated by ChEMBL
LigandPNGBDBM50259312(CHEMBL4082842)
Affinity DataKi:  185nM. Assay description: Displacement of [125I]AB-MECA from human adenosine A3 receptor expressed in CHO cell membranes after 120 mins by scintillation counting method
In DepthDetails ArticlePubMed