BDBM50259402 8-(bis(2-chlorophenyl)methyl)-N-ethyl-3-phenyl-8-azabicyclo[3.2.1]octane-3-carboxamide::CHEMBL513667
SMILES CCNC(=O)C1(CC2CCC(C1)N2C(c1ccccc1Cl)c1ccccc1Cl)c1ccccc1
InChI Key InChIKey=AXCDKMXPAYZRJH-UHFFFAOYSA-N
Data  2 KI
  Tab Delimited (TSV)   2D SDfile   Computed 3D by Vconf -m prep SDfile
Find this compound or compounds like it in BindingDB:
Activity Spreadsheet -- Enzyme Inhibition Constant Data from BindingDB
Found 2 hits for monomerid = 50259402
TargetNociceptin receptor(Homo sapiens (Human))
Schering-Plough Research Institute
Curated by ChEMBL
LigandPNGBDBM50259402(8-(bis(2-chlorophenyl)methyl)-N-ethyl-3-phenyl-8-a...)
Affinity DataKi:  7nM. Assay description: Displacement of [125I][Tyr14]nociceptin from human cloned NOP receptor expressed in CHO cells
In DepthDetails ArticlePubMed
TargetMu-type opioid receptor(Homo sapiens (Human))
Schering-Plough Research Institute
Curated by ChEMBL
LigandPNGBDBM50259402(8-(bis(2-chlorophenyl)methyl)-N-ethyl-3-phenyl-8-a...)
Affinity DataKi:  215nM. Assay description: Displacement of [3H]diprenorphine from human mu opioid receptor expressed in CHO cells
In DepthDetails ArticlePubMed