BDBM50261134 CHEMBL497550::N-Ethyl-2-piperidin-1-yl-N-{2-[3-(trifluoromethoxy)phenyl]-ethyl}ethanamine
SMILES CCN(CCN1CCCCC1)CCc1cccc(OC(F)(F)F)c1
InChI Key InChIKey=VWPPLGQILGHEGL-UHFFFAOYSA-N
Data  5 KI
  Tab Delimited (TSV)   2D SDfile   Computed 3D by Vconf -m prep SDfile
Find this compound or compounds like it in BindingDB:
Activity Spreadsheet -- Enzyme Inhibition Constant Data from BindingDB
Found 5 hits for monomerid = 50261134
TargetSigma non-opioid intracellular receptor 1(RAT)
University Of Maryland
Curated by ChEMBL
LigandPNGBDBM50261134(CHEMBL497550 | N-Ethyl-2-piperidin-1-yl-N-{2-[3-(t...)
Affinity DataKi:  2nM. Assay description: Displacement of [3H](+)pentazocine from opioid sigma1 receptor in rat brain homogenate
In DepthDetails ArticlePubMed
TargetSodium-dependent noradrenaline transporter(Homo sapiens (Human))
University Of Maryland
Curated by ChEMBL
LigandPNGBDBM50261134(CHEMBL497550 | N-Ethyl-2-piperidin-1-yl-N-{2-[3-(t...)
Affinity DataKi: >1.00E+4nM. Assay description: Binding affinity at NET (unknown origin)
In DepthDetails ArticlePubMed
TargetSodium-dependent serotonin transporter(Homo sapiens (Human))
University Of Maryland
Curated by ChEMBL
LigandPNGBDBM50261134(CHEMBL497550 | N-Ethyl-2-piperidin-1-yl-N-{2-[3-(t...)
Affinity DataKi: >1.00E+4nM. Assay description: Binding affinity at SERT (unknown origin)
In DepthDetails ArticlePubMed
TargetD(2) dopamine receptor(Homo sapiens (Human))
University Of Maryland
Curated by ChEMBL
LigandPNGBDBM50261134(CHEMBL497550 | N-Ethyl-2-piperidin-1-yl-N-{2-[3-(t...)
Affinity DataKi: >1.00E+4nM. Assay description: Binding affinity at dopamine D2 receptor (unknown origin)
In DepthDetails ArticlePubMed
TargetSodium-dependent dopamine transporter(Homo sapiens (Human))
University Of Maryland
Curated by ChEMBL
LigandPNGBDBM50261134(CHEMBL497550 | N-Ethyl-2-piperidin-1-yl-N-{2-[3-(t...)
Affinity DataKi: >1.00E+4nM. Assay description: Binding affinity at DAT (unknown origin)
In DepthDetails ArticlePubMed