BDBM50262446 (E)-1-(5-((dimethylamino)methyl)-2-hydroxy-4-methoxyphenyl)-3-phenylprop-2-en-1-one::CHEMBL450358
SMILES COc1cc(O)c(cc1CN(C)C)C(=O)\C=C\c1ccccc1
InChI Key InChIKey=BOPGYZDMAGFGJF-MDZDMXLPSA-N
Data  1 IC50
  Tab Delimited (TSV)   2D SDfile   Computed 3D by Vconf -m prep SDfile
Find this compound or compounds like it in BindingDB:
Activity Spreadsheet -- Enzyme Inhibition Constant Data from BindingDB
Found 1 hit for monomerid = 50262446
TargetCyclin-dependent kinase 1(Homo sapiens (Human))
Dalian University Of Technology
Curated by ChEMBL
LigandPNGBDBM50262446((E)-1-(5-((dimethylamino)methyl)-2-hydroxy-4-metho...)
Affinity DataIC50: >2.00E+4nM. Assay description: Inhibition of Cdk1/cyclin B
In DepthDetails ArticlePubMed