BDBM50263480 CHEMBL4081647
SMILES OC(=O)C(F)(F)F.ONC(=O)c1ccc(Cn2c3CN4CCC(C4)c3c3ccccc23)cc1
InChI Key InChIKey=QCDLGHQIVIYWPZ-UHFFFAOYSA-N
Data  3 KI
  Tab Delimited (TSV)   2D SDfile   Computed 3D by Vconf -m prep SDfile
Find this compound or compounds like it in BindingDB:
Activity Spreadsheet -- Enzyme Inhibition Constant Data from BindingDB
Found 3 hits for monomerid = 50263480
TargetHistone deacetylase 6(Homo sapiens (Human))
University Of Regensburg
Curated by ChEMBL
LigandPNGBDBM50263480(CHEMBL4081647)
Affinity DataKi:  6.5nM. Assay description: Inhibition of full length recombinant human N-terminal GST-tagged HDAC6 expressed in baculovirus-infected Sf9 insect cells using RHKK(Ac)AMC as subst...
In DepthDetails ArticlePubMed
TargetHistone deacetylase 8(Homo sapiens (Human))
University Of Regensburg
Curated by ChEMBL
LigandPNGBDBM50263480(CHEMBL4081647)
Affinity DataKi:  1.54E+3nM. Assay description: Inhibition of recombinant human C-terminal His-tagged HDAC8 (1 to 377 residues) expressed in baculovirus-infected insect cells using RHK(Ac)K(Ac)AMC ...
In DepthDetails ArticlePubMed
TargetHistone deacetylase 2(Homo sapiens (Human))
University Of Regensburg
Curated by ChEMBL
LigandPNGBDBM50263480(CHEMBL4081647)
Affinity DataKi:  6.10E+3nM. Assay description: Inhibition of full length recombinant human C-terminal GST-tagged HDAC2 expressed in baculovirus-infected insect cells using RHKK(Ac)AMC as substrate...
In DepthDetails ArticlePubMed