BDBM502637 US11028090, Example 579
SMILES Cc1noc(C)c1-c1ccc2nc(NCCCCN)c3nnc(C)n3c2c1
InChI Key InChIKey=MDENYQRHWWPLPX-UHFFFAOYSA-N
Data  1 IC50
  Tab Delimited (TSV)   2D SDfile   Computed 3D by Vconf -m prep SDfile
Find this compound or compounds like it in BindingDB:
Activity Spreadsheet -- Enzyme Inhibition Constant Data from BindingDB
Found 1 hit for monomerid = 502637
TargetBromodomain-containing protein 4(Homo sapiens (Human))
Dong Wha Pharm.
US Patent
LigandPNGBDBM502637(US11028090, Example 579)
Affinity DataIC50:  5nM. Assay description: The following experiment was performed to evaluate the ability of [1,2,4]triazolo[4,3-a]quinoxaline derivative of the present invention to inhibit th...
Ligand InfoPC cidPC sid
In DepthDetails US Patent