BDBM50264085 (2S,3R,4S,5R)-2-(2-(2,4-dihydroxyphenethyl)-5-hydroxyphenoxy)tetrahydro-2H-pyran-3,4,5-triol::CHEMBL491409
SMILES O[C@@H]1CO[C@@H](Oc2cc(O)ccc2CCc2ccc(O)cc2O)[C@H](O)[C@H]1O
InChI Key InChIKey=QKHHOTYFRWNZNT-LULLPPNCSA-N
Data  2 IC50
  Tab Delimited (TSV)   2D SDfile   Computed 3D by Vconf -m prep SDfile
Find this compound or compounds like it in BindingDB:
Activity Spreadsheet -- Enzyme Inhibition Constant Data from BindingDB
Found 2 hits for monomerid = 50264085
TargetTyrosinase(Homo sapiens (Human))
Utsunomiya University
Curated by ChEMBL
LigandPNGBDBM50264085((2S,3R,4S,5R)-2-(2-(2,4-dihydroxyphenethyl)-5-hydr...)
Affinity DataIC50:  1.60E+3nM. Assay description: Inhibition of Tyrosinase
In DepthDetails ArticlePubMed
TargetPolyphenol oxidase 2(Agaricus bisporus (Common mushroom))
Utsunomiya University
Curated by ChEMBL
LigandPNGBDBM50264085((2S,3R,4S,5R)-2-(2-(2,4-dihydroxyphenethyl)-5-hydr...)
Affinity DataIC50:  1.60E+3nM. Assay description: Inhibition of mushroom tyrosinase
In DepthDetails ArticlePubMed