BDBM50267198 (2R)-1-(1H-Indol-4-yloxy)-3-{[2-(2-methoxyphenoxy)ethyl]amino}propan-2-ol::CHEMBL477672
SMILES COc1ccccc1OCCNC[C@@H](O)COc1cccc2[nH]ccc12
InChI Key InChIKey=NYTATKPYSHURLX-OAHLLOKOSA-N
Data  1 KI
  Tab Delimited (TSV)   2D SDfile   Computed 3D by Vconf -m prep SDfile
Find this compound or compounds like it in BindingDB:
Activity Spreadsheet -- Enzyme Inhibition Constant Data from BindingDB
Found 1 hit for monomerid = 50267198
TargetBeta-1 adrenergic receptor(Rattus norvegicus (Rat))
RzeszóW University Of Technology
Curated by ChEMBL
LigandPNGBDBM50267198((2R)-1-(1H-Indol-4-yloxy)-3-{[2-(2-methoxyphenoxy)...)
Affinity DataKi:  143nM. Assay description: Displacement of [3H]CGP12177 from beta1 adrenergic receptor in rat cerebral cortex by liquid scintillation method
In DepthDetails ArticlePubMed