BDBM50267774 CHEMBL523100::cyclohexyl(4-(naphthalen-1-ylsulfonyl)piperazin-1-yl)methanone
SMILES O=C(C1CCCCC1)N1CCN(CC1)S(=O)(=O)c1cccc2ccccc12
InChI Key InChIKey=YCYPTKGWJASRLD-UHFFFAOYSA-N
Data  2 IC50  1 EC50
  Tab Delimited (TSV)   2D SDfile   Computed 3D by Vconf -m prep SDfile
Find this compound or compounds like it in BindingDB:
Activity Spreadsheet -- Enzyme Inhibition Constant Data from BindingDB
Found 3 hits for monomerid = 50267774
TargetCannabinoid receptor 2(Homo sapiens (Human))
Merck Research Laboratories
Curated by ChEMBL
LigandPNGBDBM50267774(CHEMBL523100 | cyclohexyl(4-(naphthalen-1-ylsulfon...)
Affinity DataIC50: >1.00E+4nM. Assay description: Displacement of [3H]CP55940 from human recombinant CB2R expressed in CHO cells
In DepthDetails ArticlePubMed
TargetCannabinoid receptor 1(Homo sapiens (Human))
Merck Research Laboratories
Curated by ChEMBL
LigandPNGBDBM50267774(CHEMBL523100 | cyclohexyl(4-(naphthalen-1-ylsulfon...)
Affinity DataEC50:  0.600nM. Assay description: Inverse agonist activity at human recombinant CB1R expressed in CHO cells assessed as increase in forskolin-stimulated cAMP level
In DepthDetails ArticlePubMed
TargetCannabinoid receptor 1(Homo sapiens (Human))
Merck Research Laboratories
Curated by ChEMBL
LigandPNGBDBM50267774(CHEMBL523100 | cyclohexyl(4-(naphthalen-1-ylsulfon...)
Affinity DataIC50:  95nM. Assay description: Displacement of [3H]CP55940 from human recombinant CB1R expressed in CHO cells
In DepthDetails ArticlePubMed