BDBM50267949 CHEMBL504856
SMILES CC(C)C[C@H](NC(=O)[C@H](Cc1ccccc1)NC(=O)[C@H](COC(C)=O)NC(=O)[C@H](CO)NC(=O)CN)C(=O)N[C@@H](CO)C(=O)N1CCC[C@H]1C(=O)N[C@@H](CCC(O)=O)C(=O)N[C@@H](Cc1cnc[nH]1)C(=O)N[C@@H](CCC(N)=O)C(=O)N[C@@H](CCCN=C(N)N)C(=O)N[C@@H](C(C)C)C(=O)N[C@@H](CCC(N)=O)C(=O)N[C@@H](CCC(N)=O)C(=O)N[C@@H](CCCN=C(N)N)C(=O)N[C@@H](CCCCN)C(=O)N[C@@H](CCC(O)=O)C(=O)N[C@@H](CO)C(=O)N[C@@H](CCCCN)C(=O)N[C@@H](CCCCN)C(=O)N1CCC[C@H]1C(=O)N1CCC[C@H]1C(=O)N[C@@H](C)C(=O)N[C@@H](CCCCN)C(=O)N[C@@H](CC(C)C)C(=O)N[C@@H](CCC(N)=O)C(=O)N1CCC[C@H]1C(=O)N[C@@H](CCCN=C(N)N)C(O)=O
InChI Key InChIKey=VHJOINJHZFYAGX-AXDPFIOISA-N
Data  2 IC50
  Tab Delimited (TSV)   2D SDfile   Computed 3D by Vconf -m prep SDfile
Find this compound or compounds like it in BindingDB:
Activity Spreadsheet -- Enzyme Inhibition Constant Data from BindingDB
Found 2 hits for monomerid = 50267949
TargetGrowth hormone secretagogue receptor type 1(Homo sapiens (Human))
University Of Western Ontario
Curated by ChEMBL
LigandPNGBDBM50267949(CHEMBL504856)
Affinity DataIC50: >2.00E+6nM. Assay description: Displacement of [35S]MK-0677 from human growth hormone secretagogue receptor
In DepthDetails ArticlePubMed
TargetGrowth hormone secretagogue receptor type 1(Homo sapiens (Human))
University Of Western Ontario
Curated by ChEMBL
LigandPNGBDBM50267949(CHEMBL504856)
Affinity DataIC50: >2.00E+3nM. Assay description: Binding affinity to cloned human growth hormone secretagogue receptor type 1 in a competitive binding assay with [35S]-MK-0677 as a radiolabeled liga...
In DepthDetails ArticlePubMed