BDBM50271243 CHEMBL3718344
SMILES CC(C)n1nc(cc1C1CCN(CC1)C1COC1)-c1cnc2[nH]cc(c2c1)C(F)(F)F
InChI Key InChIKey=LROXJGZSMIOABE-UHFFFAOYSA-N
Data  1 KI  1 IC50
  Tab Delimited (TSV)   2D SDfile   Computed 3D by Vconf -m prep SDfile
Find this compound or compounds like it in BindingDB:
Activity Spreadsheet -- Enzyme Inhibition Constant Data from BindingDB
Found 2 hits for monomerid = 50271243
TargetMitogen-activated protein kinase kinase kinase 12(Homo sapiens (Human))
Wuxi Apptec
Curated by ChEMBL
LigandPNGBDBM50271243(CHEMBL3718344)
Affinity DataKi:  2.30nM. Assay description: Binding affinity to N-terminally GST-tagged wild type human DLK (1 to 520 residues) expressed in sf21 insect cells using N-terminally His-tagged MKK4...
In DepthDetails ArticlePubMed
TargetMitogen-activated protein kinase kinase kinase 12(Homo sapiens (Human))
Wuxi Apptec
Curated by ChEMBL
LigandPNGBDBM50271243(CHEMBL3718344)
Affinity DataIC50:  485nM. Assay description: Inhibition of doxycycline inducible human DLK transfected in HEK293 cells assessed as JNK phosphorylation after 5.5 hrs by Hoechst-33342 staining-bas...
In DepthDetails ArticlePubMed