BDBM50273061 2-(4-(2-(Ethyl(methyl)amino)ethyl)phenoxy)-5,6-dimethoxy-indan-1-one::CHEMBL457841
SMILES CCN(C)CCc1ccc(OC2Cc3cc(OC)c(OC)cc3C2=O)cc1
InChI Key InChIKey=XOYDABHRJOIFTH-UHFFFAOYSA-N
Data  2 IC50
  Tab Delimited (TSV)   2D SDfile   Computed 3D by Vconf -m prep SDfile
Find this compound or compounds like it in BindingDB:
Activity Spreadsheet -- Enzyme Inhibition Constant Data from BindingDB
Found 2 hits for monomerid = 50273061
TargetCarboxylic ester hydrolase(Rattus norvegicus (rat))
Zhejiang University
Curated by ChEMBL
LigandPNGBDBM50273061(2-(4-(2-(Ethyl(methyl)amino)ethyl)phenoxy)-5,6-dim...)
Affinity DataIC50:  2.20E+4nM. Assay description: Inhibition of BuchE in rat serum by Ellman's method
In DepthDetails ArticlePubMed
TargetAcetylcholinesterase(Rattus norvegicus (rat))
Zhejiang University
Curated by ChEMBL
LigandPNGBDBM50273061(2-(4-(2-(Ethyl(methyl)amino)ethyl)phenoxy)-5,6-dim...)
Affinity DataIC50:  51.6nM. Assay description: Inhibition of AchE in rat cortex by Ellman's method
In DepthDetails ArticlePubMed