BDBM50273222 2-(4-(3-(Ethyl(methyl)amino)propanoyl)phenoxy)-5,6-dimethoxy-indan-1-one::CHEMBL456968
SMILES CCN(C)CCC(=O)c1ccc(OC2Cc3cc(OC)c(OC)cc3C2=O)cc1
InChI Key InChIKey=ZQTCXVJEBYTDAF-UHFFFAOYSA-N
Data  2 IC50
  Tab Delimited (TSV)   2D SDfile   Computed 3D by Vconf -m prep SDfile
Find this compound or compounds like it in BindingDB:
Activity Spreadsheet -- Enzyme Inhibition Constant Data from BindingDB
Found 2 hits for monomerid = 50273222
TargetCarboxylic ester hydrolase(Rattus norvegicus (rat))
Zhejiang University
Curated by ChEMBL
LigandPNGBDBM50273222(2-(4-(3-(Ethyl(methyl)amino)propanoyl)phenoxy)-5,6...)
Affinity DataIC50:  4.51E+3nM. Assay description: Inhibition of BuchE in rat serum by Ellman's method
In DepthDetails ArticlePubMed
TargetAcetylcholinesterase(Rattus norvegicus (rat))
Zhejiang University
Curated by ChEMBL
LigandPNGBDBM50273222(2-(4-(3-(Ethyl(methyl)amino)propanoyl)phenoxy)-5,6...)
Affinity DataIC50:  1.85nM. Assay description: Inhibition of AchE in rat cortex by Ellman's method
In DepthDetails ArticlePubMed