BDBM50274733 CHEMBL4127080
SMILES Cc1cc(O)cc(C)c1C[C@H](N)C(=O)N[C@H](CCCNC(N)=N)C(=O)N[C@@H](Cc1ccccc1-c1ccccc1)C(=O)NCC(N)=O
InChI Key InChIKey=KCJRXZKWDKTEFK-NHKHRBQYSA-N
Data  4 IC50
  Tab Delimited (TSV)   2D SDfile   Computed 3D by Vconf -m prep SDfile
Find this compound or compounds like it in BindingDB:
Activity Spreadsheet -- Enzyme Inhibition Constant Data from BindingDB
Found 4 hits for monomerid = 50274733
TargetMu-type opioid receptor(GUINEA PIG)
Vrije Universiteit Brussel
Curated by ChEMBL
LigandPNGBDBM50274733(CHEMBL4127080)
Affinity DataIC50:  3.5nM. Assay description: Agonist activity at mu-opioid receptor in guinea pig ileum assessed as inhibition of electrically induced contractions
In DepthDetails ArticlePubMed
TargetMu-type opioid receptor(MOUSE)
Vrije Universiteit Brussel
Curated by ChEMBL
LigandPNGBDBM50274733(CHEMBL4127080)
Affinity DataIC50:  0.540nM. Assay description: Displacement of [125I]-DAMGO from mouse Flag-tagged mu-opioid receptor expressed in HEK293 cell membranes after 60 mins by gamma counting
In DepthDetails ArticlePubMed
TargetDelta-type opioid receptor(MOUSE)
Vrije Universiteit Brussel
Curated by ChEMBL
LigandPNGBDBM50274733(CHEMBL4127080)
Affinity DataIC50:  20nM. Assay description: Displacement of [125I]-Deltorphin 2 from mouse Flag-tagged delta-opioid receptor expressed in HEK293 cell membranes after 60 mins by gamma counting
In DepthDetails ArticlePubMed
TargetDelta-type opioid receptor(MOUSE)
Vrije Universiteit Brussel
Curated by ChEMBL
LigandPNGBDBM50274733(CHEMBL4127080)
Affinity DataIC50:  7nM. Assay description: Agonist activity at delta-opioid receptor in mouse vasa deferens assessed as inhibition of electrically induced contractions
In DepthDetails ArticlePubMed