BDBM50274894 (Z)-5-(Naphthalen-1'-ylmethylene)-2-thioxothiazolidin-4-one::(Z)-5-(Naphthalen-1-ylmethylene)-2-thioxothiazolidin-4-one::CHEMBL457747
SMILES SC1=NC(=O)C(S1)=Cc1cccc2ccccc12
InChI Key InChIKey=KHWBBJGNDBRXEW-UHFFFAOYSA-N
Data  3 IC50
  Tab Delimited (TSV)   2D SDfile   Computed 3D by Vconf -m prep SDfile
Find this compound or compounds like it in BindingDB:
Activity Spreadsheet -- Enzyme Inhibition Constant Data from BindingDB
Found 3 hits for monomerid = 50274894
TargetArylamine N-acetyltransferase 2(Mus musculus)
University Of Oxford
Curated by ChEMBL
LigandPNGBDBM50274894((Z)-5-(Naphthalen-1'-ylmethylene)-2-thioxothiazoli...)
Affinity DataIC50: >3.00E+4nM. Assay description: Inhibition of mouse recombinant NAT2 assessed as hydrolysis of acetyl coA using PABA as substrate by Ellman's method
In DepthDetails ArticlePubMed
TargetSerine/threonine-protein kinase pim-1(Homo sapiens (Human))
University Of Oxford
Curated by ChEMBL
LigandPNGBDBM50274894((Z)-5-(Naphthalen-1'-ylmethylene)-2-thioxothiazoli...)
Affinity DataIC50:  62nM. Assay description: Inhibition of recombinant PIM1 (unknown origin) by pyruvate kinase/lactate dehydrogenase-coupled assay
In DepthDetails ArticlePubMed
TargetAldo-keto reductase family 1 member B1 [K65Q](Bos taurus (Cattle))
University Of Messina
Curated by ChEMBL
LigandPNGBDBM50274894((Z)-5-(Naphthalen-1'-ylmethylene)-2-thioxothiazoli...)
Affinity DataIC50:  2.27E+3nM. Assay description: Inhibition of bovine lens aldose reductase assessed as inhibition of NDAPH oxidation by non-linear regression analysis
In DepthDetails ArticlePubMed