BDBM50275256 CHEMBL485939::[3,5-Dimethyl-4-(4'-hydroxy-3'-phenylbenzyl)phenoxy]methylphosphonicAcid
SMILES Cc1cc(OCP(O)(O)=O)cc(C)c1Cc1ccc(O)c(c1)-c1ccccc1
InChI Key InChIKey=GDGHGXAILIZPNP-UHFFFAOYSA-N
Data  2 KI
  Tab Delimited (TSV)   2D SDfile   Computed 3D by Vconf -m prep SDfile
Find this compound or compounds like it in BindingDB:
Activity Spreadsheet -- Enzyme Inhibition Constant Data from BindingDB
Found 2 hits for monomerid = 50275256
TargetThyroid hormone receptor beta(Homo sapiens (Human))
Metabasis Therapeutics
Curated by ChEMBL
LigandPNGBDBM50275256(CHEMBL485939 | [3,5-Dimethyl-4-(4'-hydroxy-3'-phen...)
Affinity DataKi:  106nM. Assay description: Displacement of [125I]3,5,3'-triiodo-L-thyronine His-tagged human recombinant TRbeta1 by scintillation proximity assay
In DepthDetails ArticlePubMed
TargetThyroid hormone receptor alpha(Homo sapiens (Human))
Metabasis Therapeutics
Curated by ChEMBL
LigandPNGBDBM50275256(CHEMBL485939 | [3,5-Dimethyl-4-(4'-hydroxy-3'-phen...)
Affinity DataKi:  1.17E+3nM. Assay description: Displacement of [125I]3,5,3'-triiodo-L-thyronine from His-tagged human recombinant TRalpha1 by scintillation proximity assay
In DepthDetails ArticlePubMed