BDBM50277460 1,1,1-trifluoro-3-(2-(3-(1,1,2,2-tetrafluoroethoxy)phenyl)-5-(4-(trifluoromethoxy)phenyl)-3,4-dihydroquinolin-1(2H)-yl)propan-2-ol::CHEMBL471064
SMILES OC(CN1C(CCc2c1cccc2-c1ccc(OC(F)(F)F)cc1)c1cccc(OC(F)(F)C(F)F)c1)C(F)(F)F
InChI Key InChIKey=CJGFLSMKDCVJOR-UHFFFAOYSA-N
Data  1 IC50
  Tab Delimited (TSV)   2D SDfile   Computed 3D by Vconf -m prep SDfile
Find this compound or compounds like it in BindingDB:
Activity Spreadsheet -- Enzyme Inhibition Constant Data from BindingDB
Found 1 hit for monomerid = 50277460
TargetCholesteryl ester transfer protein(Homo sapiens (Human))
Johnson & Johnson Pharmaceutical Research & Development
Curated by ChEMBL
LigandPNGBDBM50277460(1,1,1-trifluoro-3-(2-(3-(1,1,2,2-tetrafluoroethoxy...)
Affinity DataIC50:  500nM. Assay description: Inhibition of human plasma derived CETP
In DepthDetails ArticlePubMed