BDBM50277811 1-(2,5-bis(3-(trifluoromethoxy)phenyl)-3,4-dihydroquinolin-1(2H)-yl)-3-chloropropan-2-ol::CHEMBL485183
SMILES OC(CCl)CN1C(CCc2c1cccc2-c1cccc(OC(F)(F)F)c1)c1cccc(OC(F)(F)F)c1
InChI Key InChIKey=DLNHKQIOTRJLQP-UHFFFAOYSA-N
Data  1 IC50
  Tab Delimited (TSV)   2D SDfile   Computed 3D by Vconf -m prep SDfile
Find this compound or compounds like it in BindingDB:
Activity Spreadsheet -- Enzyme Inhibition Constant Data from BindingDB
Found 1 hit for monomerid = 50277811
TargetCholesteryl ester transfer protein(Homo sapiens (Human))
Johnson & Johnson Pharmaceutical Research & Development
Curated by ChEMBL
LigandPNGBDBM50277811(1-(2,5-bis(3-(trifluoromethoxy)phenyl)-3,4-dihydro...)
Affinity DataIC50:  744nM. Assay description: Inhibition of human plasma derived CETP
In DepthDetails ArticlePubMed