BDBM50279644 CHEMBL4161890
SMILES Cc1cc(O)cc(C)c1C[C@H](N)C(=O)N[C@H](CCCNC(N)=N)C(=O)N[C@H]1Cc2ccc3ccccc3c2CN(CC(N)=O)C1=O
InChI Key InChIKey=YIFWHJCELZDCAJ-IARZGTGTSA-N
Data  4 IC50
  Tab Delimited (TSV)   2D SDfile   Computed 3D by Vconf -m prep SDfile
Find this compound or compounds like it in BindingDB:
Activity Spreadsheet -- Enzyme Inhibition Constant Data from BindingDB
Found 4 hits for monomerid = 50279644
TargetMu-type opioid receptor(MOUSE)
Vrije Universiteit Brussel
Curated by ChEMBL
LigandPNGBDBM50279644(CHEMBL4161890)
Affinity DataIC50:  2.20nM. Assay description: Displacement of [125I]-DAMGO from mouse FLAG-tagged Mu-type opioid receptor expressed in HEK293 cell membranes after 60 mins by gamma counting analys...
In DepthDetails ArticlePubMed
TargetDelta-type opioid receptor(MOUSE)
Vrije Universiteit Brussel
Curated by ChEMBL
LigandPNGBDBM50279644(CHEMBL4161890)
Affinity DataIC50:  114nM. Assay description: Agonist activity at delta-type opioid receptor in mouse vas deferens assessed as inhibition of electrically stimulated contractions
In DepthDetails ArticlePubMed
TargetMu-type opioid receptor(GUINEA PIG)
Vrije Universiteit Brussel
Curated by ChEMBL
LigandPNGBDBM50279644(CHEMBL4161890)
Affinity DataIC50:  21nM. Assay description: Agonist activity at mu-opioid receptor in guinea pig ileum assessed as inhibition of electrically induced contractions
In DepthDetails ArticlePubMed
TargetDelta-type opioid receptor(MOUSE)
Vrije Universiteit Brussel
Curated by ChEMBL
LigandPNGBDBM50279644(CHEMBL4161890)
Affinity DataIC50:  153nM. Assay description: Displacement of [125I]-Deltorphin II from mouse FLAG-tagged delta-type opioid receptor expressed in HEK293 cell membranes after 60 mins by gamma coun...
In DepthDetails ArticlePubMed