BDBM50279999 CHEMBL4169541
SMILES Cc1ccc(NC(=O)CSC(=S)N\N=C\c2nn(C)cc2Cl)cc1
InChI Key InChIKey=XCBDZIIPTMORAX-REZTVBANSA-N
Data  1 IC50
  Tab Delimited (TSV)   2D SDfile   Computed 3D by Vconf -m prep SDfile
Find this compound or compounds like it in BindingDB:
Activity Spreadsheet -- Enzyme Inhibition Constant Data from BindingDB
Found 1 hit for monomerid = 50279999
TargetCystathionine gamma-lyase(Homo sapiens (Human))
University Of Illinois At Chicago
Curated by ChEMBL
LigandPNGBDBM50279999(CHEMBL4169541)
Affinity DataIC50:  3.00E+3nM. Assay description: Inhibition of cystathionine gamma-lyase (unknown origin) assessed as reduction in cysteine formation from CPM using L-cystathionine pre-incubated for...
In DepthDetails ArticlePubMed