BDBM50281144 (2R,3R,4S,5R)-2-[6-(Azepan-1-ylamino)-2-chloro-purin-9-yl]-5-hydroxymethyl-tetrahydro-furan-3,4-diol::CHEMBL88911
SMILES OC[C@H]1O[C@H]([C@H](O)[C@@H]1O)n1cnc2c(NN3CCCCCC3)nc(Cl)nc12
InChI Key InChIKey=XHFCHAWBLYEVDE-SDBHATRESA-N
Data  2 KI
  Tab Delimited (TSV)   2D SDfile   Computed 3D by Vconf -m prep SDfile
Find this compound or compounds like it in BindingDB:
Activity Spreadsheet -- Enzyme Inhibition Constant Data from BindingDB
Found 2 hits for monomerid = 50281144
TargetAdenosine receptor A1(Rattus norvegicus (rat))
TBA
Curated by ChEMBL
LigandPNGBDBM50281144((2R,3R,4S,5R)-2-[6-(Azepan-1-ylamino)-2-chloro-pur...)
Affinity DataKi:  9.30nM. Assay description: Tested for inhibition of adenosine A1 receptor binding to rat brain
In DepthDetails Article
TargetAdenosine receptor A2a/A2b(Rattus norvegicus)
TBA
Curated by ChEMBL
LigandPNGBDBM50281144((2R,3R,4S,5R)-2-[6-(Azepan-1-ylamino)-2-chloro-pur...)
Affinity DataKi:  1.13E+3nM. Assay description: Tested for inhibition of adenosine A2 receptor binding to rat brain
In DepthDetails Article