BDBM50281884 2-(1-Dodecyl-piperidin-4-yl)-propan-1-ol::CHEMBL17737
SMILES CCCCCCCCCCCCN1CCC(CC1)C(C)CO
InChI Key InChIKey=HUCQABKJUGPSFW-UHFFFAOYSA-N
Data  1 IC50
  Tab Delimited (TSV)   2D SDfile   Computed 3D by Vconf -m prep SDfile
Find this compound or compounds like it in BindingDB:
Activity Spreadsheet -- Enzyme Inhibition Constant Data from BindingDB
Found 1 hit for monomerid = 50281884
TargetLanosterol synthase(Rattus norvegicus)
TBA
Curated by ChEMBL
LigandPNGBDBM50281884(2-(1-Dodecyl-piperidin-4-yl)-propan-1-ol | CHEMBL1...)
Affinity DataIC50:  420nM. Assay description: Inhibitory concentration against purified rat liver Oxidosqualene cyclase (OSC)
In DepthDetails Article