BDBM50281891 1-Dodecyl-piperidin-4-ol::CHEMBL17729
SMILES CCCCCCCCCCCCN1CCC(O)CC1
InChI Key InChIKey=QVWOKZAKXLGMOQ-UHFFFAOYSA-N
Data  1 IC50
  Tab Delimited (TSV)   2D SDfile   Computed 3D by Vconf -m prep SDfile
Find this compound or compounds like it in BindingDB:
Activity Spreadsheet -- Enzyme Inhibition Constant Data from BindingDB
Found 1 hit for monomerid = 50281891
TargetLanosterol synthase(Rattus norvegicus)
TBA
Curated by ChEMBL
LigandPNGBDBM50281891(1-Dodecyl-piperidin-4-ol | CHEMBL17729)
Affinity DataIC50:  9.00E+3nM. Assay description: Inhibitory concentration against purified rat liver Oxidosqualene cyclase (OSC)
In DepthDetails Article