BDBM50282848 1-{2-[(S)-3-(2-Chloro-phenyl)-2-mercaptomethyl-propionylamino]-propionyl}-pyrrolidine-2-carboxylic acid::CHEMBL50312
SMILES C[C@H](NC(=O)[C@@H](CS)Cc1ccccc1Cl)C(=O)N1CCC[C@@H]1C(O)=O
InChI Key InChIKey=GXLIURHEJWHWAA-NJZAAPMLSA-N
Data  2 IC50
  Tab Delimited (TSV)   2D SDfile   Computed 3D by Vconf -m prep SDfile
Find this compound or compounds like it in BindingDB:
Activity Spreadsheet -- Enzyme Inhibition Constant Data from BindingDB
Found 2 hits for monomerid = 50282848
TargetNeprilysin(Rattus norvegicus (Rat))
TBA
Curated by ChEMBL
LigandPNGBDBM50282848(1-{2-[(S)-3-(2-Chloro-phenyl)-2-mercaptomethyl-pro...)
Affinity DataIC50:  2.20nM. Assay description: In vitro inhibition of rat kidney neutral endopeptidase (NEP) by fluorometric assay using Dansyl-Gly-Phe-Arg as substrate
In DepthDetails Article
TargetAngiotensin-converting enzyme(Oryctolagus cuniculus)
TBA
Curated by ChEMBL
LigandPNGBDBM50282848(1-{2-[(S)-3-(2-Chloro-phenyl)-2-mercaptomethyl-pro...)
Affinity DataIC50:  25nM. Assay description: In vitro inhibition of rabbit lung Angiotensin I converting enzyme (ACE) using Hippuryl-His-Leu as substrate
In DepthDetails Article