BDBM50283123 ((S)-1-{(S)-3-Hydroxy-1-[(S)-1-((1S,2R)-2-hydroxy-indan-1-ylcarbamoyl)-2-phenyl-ethyl]-pyrrolidin-3-yl}-2-phenyl-ethyl)-carbamic acid tert-butyl ester::CHEMBL68528::L-707897
SMILES CC(C)(C)OC(=O)N[C@@H](Cc1ccccc1)[C@]1(O)CCN(C1)[C@@H](Cc1ccccc1)C(=O)N[C@@H]1[C@H](O)Cc2ccccc12
InChI Key InChIKey=NXJBGBMSUYPTGF-NJSKGKFKSA-N
Data  1 IC50
  Tab Delimited (TSV)   2D SDfile   Computed 3D by Vconf -m prep SDfile
Find this compound or compounds like it in BindingDB:
Activity Spreadsheet -- Enzyme Inhibition Constant Data from BindingDB
Found 1 hit for monomerid = 50283123
TargetGag-Pol polyprotein [489-587](Human immunodeficiency virus type 1)
TBA
Curated by ChEMBL
LigandPNGBDBM50283123(((S)-1-{(S)-3-Hydroxy-1-[(S)-1-((1S,2R)-2-hydroxy-...)
Affinity DataIC50:  600nM. Assay description: Inhibition of human immunodeficiency virus type 1 (HIV-1) protease
In DepthDetails Article