BDBM50283729 (S)-1-[(2S,4R)-2-Hydroxy-4-((1S,2R)-2-hydroxy-indan-1-ylcarbamoyl)-5-pyridin-4-yl-pentyl]-4-(quinoline-8-sulfonyl)-piperazine-2-carboxylic acid tert-butylamide::CHEMBL433165
SMILES CC(C)(C)NC(=O)[C@@H]1CN(CCN1C[C@@H](O)C[C@@H](Cc1ccncc1)C(=O)N[C@@H]1[C@H](O)Cc2ccccc12)S(=O)(=O)c1cccc2cccnc12
InChI Key InChIKey=AFVXCMZTRNKQLP-OQOOGSQVSA-N
Data  1 IC50
  Tab Delimited (TSV)   2D SDfile   Computed 3D by Vconf -m prep SDfile
Find this compound or compounds like it in BindingDB:
Activity Spreadsheet -- Enzyme Inhibition Constant Data from BindingDB
Found 1 hit for monomerid = 50283729
TargetGag-Pol polyprotein [489-587](Human immunodeficiency virus type 1)
TBA
Curated by ChEMBL
LigandPNGBDBM50283729((S)-1-[(2S,4R)-2-Hydroxy-4-((1S,2R)-2-hydroxy-inda...)
Affinity DataIC50:  0.0150nM. Assay description: Inhibition of Human Immunodeficiency virus-1 protease
In DepthDetails Article