BDBM50284005 LAKOOCHIN A
SMILES [#6]-[#8]-c1cc(-[#8]-[#6])c(-[#6]\[#6]=[#6](\[#6])-[#6])c(-c2cc3ccc(-[#8])cc3o2)c1-[#6]\[#6]=[#6](\[#6])-[#6]
InChI Key InChIKey=CHDJBHWCUVZCGP-UHFFFAOYSA-N
Data  2 IC50
  Tab Delimited (TSV)   2D SDfile   Computed 3D by Vconf -m prep SDfile
Find this compound or compounds like it in BindingDB:
Activity Spreadsheet -- Enzyme Inhibition Constant Data from BindingDB
Found 2 hits for monomerid = 50284005
TargetAcetylcholinesterase(Electrophorus electricus (Electric eel))
Srinakharinwirot University
Curated by ChEMBL
LigandPNGBDBM50284005(LAKOOCHIN A)
Affinity DataIC50:  2.74E+4nM. Assay description: Inhibition of electric eel AChE using acetylthiocholine as substrate preincubated for 15 mins followed by substrate addition measured after 5 mins by...
In DepthDetails ArticlePubMed
TargetCholinesterase(Homo sapiens (Human))
Srinakharinwirot University
Curated by ChEMBL
LigandPNGBDBM50284005(LAKOOCHIN A)
Affinity DataIC50:  1.39E+4nM. Assay description: Inhibition of BChE (unknown origin) using thiocholine as substrate preincubated for 15 mins followed by substrate addition measured after 5 mins by E...
In DepthDetails ArticlePubMed