BDBM50285000 2-Methoxy-3-[2'-(5-oxo-4,5-dihydro-[1,2,4]oxadiazol-3-yl)-biphenyl-4-ylmethyl]-3H-benzoimidazole-4-carboxylic acid::CHEMBL57783
SMILES COc1nc2cccc(C(O)=O)c2n1Cc1ccc(cc1)-c1ccccc1-c1nc(=O)o[nH]1
InChI Key InChIKey=YWPWTUFGPHTUPP-UHFFFAOYSA-N
Data  1 IC50
  Tab Delimited (TSV)   2D SDfile   Computed 3D by Vconf -m prep SDfile
Find this compound or compounds like it in BindingDB:
Activity Spreadsheet -- Enzyme Inhibition Constant Data from BindingDB
Found 1 hit for monomerid = 50285000
TargetType-1 angiotensin II receptor(Bos taurus)
TBA
Curated by ChEMBL
LigandPNGBDBM50285000(2-Methoxy-3-[2'-(5-oxo-4,5-dihydro-[1,2,4]oxadiazo...)
Affinity DataIC50:  360nM. Assay description: Displacement of [125 I]-AII (0.2 nM) from bovine adrenal cortical membrane angiotensin II (AII) receptor at 10e-7 M
In DepthDetails Article