BDBM50285934 1-[2-((S)-3-Benzoylamino-2-oxo-4-phenyl-butylamino)-acetyl]-pyrrolidine-2-carboxylic acid::CHEMBL97191
SMILES OC(=O)[C@@H]1CCCN1C(=O)CNCC(=O)[C@H](Cc1ccccc1)NC(=O)c1ccccc1
InChI Key InChIKey=WPGNBXOKKGNCRD-PMACEKPBSA-N
Data  1 IC50
  Tab Delimited (TSV)   2D SDfile   Computed 3D by Vconf -m prep SDfile
Find this compound or compounds like it in BindingDB:
Activity Spreadsheet -- Enzyme Inhibition Constant Data from BindingDB
Found 1 hit for monomerid = 50285934
TargetAngiotensin-converting enzyme 2(Homo sapiens (Human))
TBA
Curated by ChEMBL
LigandPNGBDBM50285934(1-[2-((S)-3-Benzoylamino-2-oxo-4-phenyl-butylamino...)
Affinity DataIC50:  70nM. Assay description: Inhibitory activity against angiotensin converting enzyme
In DepthDetails Article