BDBM50286103 CHEMBL102092::Morphinan Cyclic Imine analogue
SMILES COC12C=CC34C[C@@]1(C)C(=N[C@H]2C31CCN(C)C4Cc2ccc(O)cc12)c1ccccc1
InChI Key InChIKey=DIWFHEYPDQRWTR-IRLVDXFISA-N
Data  4 IC50
  Tab Delimited (TSV)   2D SDfile   Computed 3D by Vconf -m prep SDfile
Find this compound or compounds like it in BindingDB:
Activity Spreadsheet -- Enzyme Inhibition Constant Data from BindingDB
Found 4 hits for monomerid = 50286103
TargetDelta-type opioid receptor(Homo sapiens (Human))
TBA
Curated by ChEMBL
LigandPNGBDBM50286103(CHEMBL102092 | Morphinan Cyclic Imine analogue)
Affinity DataIC50:  0.690nM. Assay description: Compound was tested for its ability to displace [3H]-Cl-DPDPE from delta opioid receptor in hartley guinea pig brain membrane in the presence of 100 ...
In DepthDetails Article
TargetKappa-type opioid receptor(Cavia porcellus (domestic guinea pig))
TBA
Curated by ChEMBL
LigandPNGBDBM50286103(CHEMBL102092 | Morphinan Cyclic Imine analogue)
Affinity DataIC50:  6.20nM. Assay description: Compound was tested for its ability to displace bremazocine from Opioid receptor kappa 2 in hartley guinea pig brain membrane
In DepthDetails Article
TargetKappa-type opioid receptor(Cavia porcellus (domestic guinea pig))
TBA
Curated by ChEMBL
LigandPNGBDBM50286103(CHEMBL102092 | Morphinan Cyclic Imine analogue)
Affinity DataIC50:  0.520nM. Assay description: Compound was tested for its ability to displace [3H]-U-69,593 from Opioid receptor kappa 1 in hartley guinea pig brain membrane in the presence of 10...
In DepthDetails Article
TargetMu-type opioid receptor(GUINEA PIG)
TBA
Curated by ChEMBL
LigandPNGBDBM50286103(CHEMBL102092 | Morphinan Cyclic Imine analogue)
Affinity DataIC50:  0.330nM. Assay description: Compound was tested for its ability to displace [3H]-DAMGO from mu opioid receptor in hartley guinea pig brain membrane in the presence of 100 nM of ...
In DepthDetails Article