BDBM50286114 4-[1-Methyl-2-oxo-3-(3-m-tolyl-ureido)-2,3-dihydro-1H-benzo[e][1,4]diazepin-5-yl]-piperazine-1-carboxylic acid tert-butyl ester::CHEMBL431832
SMILES CN1c2ccccc2C(=NC(NC(=O)Nc2cccc(C)c2)C1=O)N1CCN(CC1)C(=O)OC(C)(C)C
InChI Key InChIKey=CNOGFXPZJZPWFQ-UHFFFAOYSA-N
Data  2 IC50
  Tab Delimited (TSV)   2D SDfile   Computed 3D by Vconf -m prep SDfile
Find this compound or compounds like it in BindingDB:
Activity Spreadsheet -- Enzyme Inhibition Constant Data from BindingDB
Found 2 hits for monomerid = 50286114
TargetCholecystokinin receptor type A(RAT)
TBA
Curated by ChEMBL
LigandPNGBDBM50286114(4-[1-Methyl-2-oxo-3-(3-m-tolyl-ureido)-2,3-dihydro...)
Affinity DataIC50: >3.00E+3nM. Assay description: Displacement of [125I]-BH CCK-8S from Cholecystokinin type A receptor in rat pancreas
In DepthDetails Article
TargetGastrin/cholecystokinin type B receptor(Homo sapiens (Human))
TBA
Curated by ChEMBL
LigandPNGBDBM50286114(4-[1-Methyl-2-oxo-3-(3-m-tolyl-ureido)-2,3-dihydro...)
Affinity DataIC50: >3.00E+3nM. Assay description: Displacement of [125I]-BH CCK-8S from Cholecystokinin type B receptor in guinea pig cortex
In DepthDetails Article