BDBM50286118 1-[5-(4-Methyl-piperazin-1-yl)-2-oxo-1-propyl-2,3-dihydro-1H-benzo[e][1,4]diazepin-3-yl]-3-m-tolyl-urea::CHEMBL101528
SMILES CCCN1c2ccccc2C(=NC(NC(=O)Nc2cccc(C)c2)C1=O)N1CCN(C)CC1
InChI Key InChIKey=HIDXDIXMVZDVNO-UHFFFAOYSA-N
Data  2 IC50
  Tab Delimited (TSV)   2D SDfile   Computed 3D by Vconf -m prep SDfile
Find this compound or compounds like it in BindingDB:
Activity Spreadsheet -- Enzyme Inhibition Constant Data from BindingDB
Found 2 hits for monomerid = 50286118
TargetGastrin/cholecystokinin type B receptor(Homo sapiens (Human))
TBA
Curated by ChEMBL
LigandPNGBDBM50286118(1-[5-(4-Methyl-piperazin-1-yl)-2-oxo-1-propyl-2,3-...)
Affinity DataIC50:  9.80nM. Assay description: Displacement of [125I]-BH CCK-8S from Cholecystokinin type B receptor in guinea pig cortex
In DepthDetails Article
TargetCholecystokinin receptor type A(RAT)
TBA
Curated by ChEMBL
LigandPNGBDBM50286118(1-[5-(4-Methyl-piperazin-1-yl)-2-oxo-1-propyl-2,3-...)
Affinity DataIC50:  3.20E+3nM. Assay description: Displacement of [125I]-BH CCK-8S from Cholecystokinin type A receptor in rat pancreas
In DepthDetails Article