BDBM50286380 2-(N',N''-Diisopropyl-guanidino)-3-naphthalen-2-yl-N-[4-(tributyl-lambda*5*-phosphanylmethyl)-phenyl]-propionamide; chloride::CHEMBL540895
SMILES [#6]-[#6]-[#6]-[#6][P+]([#6]-[#6]-[#6]-[#6])([#6]-[#6]-[#6]-[#6])[#6]-c1ccc(-[#7]-[#6](=O)-[#6@H](-[#6]-c2ccc3ccccc3c2)\[#7]=[#6](\[#7]-[#6](-[#6])-[#6])-[#7]-[#6](-[#6])-[#6])cc1
InChI Key InChIKey=CJUJGSVHEABMSQ-QNGWXLTQSA-O
Data  1 KI
  Tab Delimited (TSV)   2D SDfile   Computed 3D by Vconf -m prep SDfile
Find this compound or compounds like it in BindingDB:
Activity Spreadsheet -- Enzyme Inhibition Constant Data from BindingDB
Found 1 hit for monomerid = 50286380
TargetB2 bradykinin receptor(Homo sapiens (Human))
TBA
Curated by ChEMBL
LigandPNGBDBM50286380(2-(N',N''-Diisopropyl-guanidino)-3-naphthalen-2-yl...)
Affinity DataKi:  7.05E+3nM. Assay description: Binding affinity against human IMR 90 fetal lung fibroblast bradykinin receptor B2
In DepthDetails Article