BDBM50287622 CHEMBL4160876
SMILES COc1cnc(O[C@@H]2C[C@H](N(C2)C(=O)[C@@H](NC(=O)OC(C)(C)C)C(C)(C)C)C(=O)N[C@@]2(C[C@H]2C(F)F)C(=O)NS(=O)(=O)C2CC2)c2cc(Cl)ccc12
InChI Key InChIKey=PSVSXONHXYMVQH-GGFAASIMSA-N
Data  1 IC50
PDB links: 1 PDB ID matches this monomer.
  Tab Delimited (TSV)   2D SDfile   Computed 3D by Vconf -m prep SDfile
Find this compound or compounds like it in BindingDB:
Activity Spreadsheet -- Enzyme Inhibition Constant Data from BindingDB
Found 1 hit for monomerid = 50287622
TargetGenome polyprotein/Non-structural protein 4A(Hepatitis C virus)
Bristol-Myers Squibb
Curated by ChEMBL
LigandPNGBDBM50287622(CHEMBL4160876)
Affinity DataIC50:  1nM. Assay description: Inhibition of recombinant full length HCV genotype 1a NS3/4A protease (1027 to 1711 residues) expressed in Escherichia coli strain BL21 (DE3) using R...