BDBM50287675 CHEMBL58643::Tetradecyl-phosphonic acid mono-(3-phenoxy-benzyl) ester
SMILES CCCCCCCCCCCCCCP(O)(=O)OCc1cccc(Oc2ccccc2)c1
InChI Key InChIKey=XJWBRRSTGDFXKA-UHFFFAOYSA-N
Data  1 IC50
  Tab Delimited (TSV)   2D SDfile   Computed 3D by Vconf -m prep SDfile
Find this compound or compounds like it in BindingDB:
Activity Spreadsheet -- Enzyme Inhibition Constant Data from BindingDB
Found 1 hit for monomerid = 50287675
TargetCholesteryl ester transfer protein(Homo sapiens (Human))
TBA
Curated by ChEMBL
LigandPNGBDBM50287675(CHEMBL58643 | Tetradecyl-phosphonic acid mono-(3-p...)
Affinity DataIC50:  6.00E+3nM. Assay description: Tested for inhibition of [3H]-cholesteryl linoleate(CE) transfer from donor HDL to acceptor LDL driven by recombinant human Cholesteryl ester transfe...
In DepthDetails Article