BDBM50288109 CHEMBL82123::{2-Benzyl-7-[methyl-(2-piperidin-4-yl-ethyl)-carbamoyl]-3-oxo-2,3,4,5-tetrahydro-1H-benzo[c]azepin-4-yl}-acetic acid
SMILES CN(CCC1CCNCC1)C(=O)c1ccc2CN(Cc3ccccc3)C(=O)C(CC(O)=O)Cc2c1
InChI Key InChIKey=OSKMUZRGKURIOY-UHFFFAOYSA-N
Data  1 KI
  Tab Delimited (TSV)   2D SDfile   Computed 3D by Vconf -m prep SDfile
Find this compound or compounds like it in BindingDB:
Activity Spreadsheet -- Enzyme Inhibition Constant Data from BindingDB
Found 1 hit for monomerid = 50288109
TargetIntegrin alpha-IIb/beta-3(Homo sapiens (Human))
TBA
Curated by ChEMBL
LigandPNGBDBM50288109(CHEMBL82123 | {2-Benzyl-7-[methyl-(2-piperidin-4-y...)
Affinity DataKi:  1nM. Assay description: In vitro binding affinity against human alpha IIb beta3 integrin
In DepthDetails Article