BDBM50291352 (2,3-Dihydro-indol-1-yl)-[3-(1,3,4,9-tetrahydro-beta-carbolin-2-ylmethyl)-phenyl]-methanone::CHEMBL165364
SMILES O=C(N1CCc2ccccc12)c1cccc(CN2CCc3c(C2)[nH]c2ccccc32)c1
InChI Key InChIKey=PDBBHWHTQRCWFH-UHFFFAOYSA-N
Data  3 KI
  Tab Delimited (TSV)   2D SDfile   Computed 3D by Vconf -m prep SDfile
Find this compound or compounds like it in BindingDB:
Activity Spreadsheet -- Enzyme Inhibition Constant Data from BindingDB
Found 3 hits for monomerid = 50291352
TargetAlpha-1A/Alpha-1B/Alpha-1D adrenergic receptor(Homo sapiens (Human))
TBA
Curated by ChEMBL
LigandPNGBDBM50291352((2,3-Dihydro-indol-1-yl)-[3-(1,3,4,9-tetrahydro-be...)
Affinity DataKi:  2.90nM. Assay description: Compound was measured in vivo for its binding affinity at Alpha-1 adrenergic receptor using [3H]prazosin as radioligand.
In DepthDetails Article
Target5-hydroxytryptamine receptor 1A(Homo sapiens (Human))
TBA
Curated by ChEMBL
LigandPNGBDBM50291352((2,3-Dihydro-indol-1-yl)-[3-(1,3,4,9-tetrahydro-be...)
Affinity DataKi:  9.20nM. Assay description: Compound was measured in vivo for its binding affinity at 5-hydroxytryptamine 1A receptor using [3H]-8-OH-DPAT as radioligand
In DepthDetails Article
TargetD(2) dopamine receptor(Homo sapiens (Human))
TBA
Curated by ChEMBL
LigandPNGBDBM50291352((2,3-Dihydro-indol-1-yl)-[3-(1,3,4,9-tetrahydro-be...)
Affinity DataKi: >1.00E+3nM. Assay description: Compound was measured in vivo for its binding affinity at Dopamine receptor D2 using [3H]-spiperone as radioligand.
In DepthDetails Article