BDBM50292299 (5S)-3-(3-fluoro-4-(3-methylisoxazol-5-yl)phenyl)-5-((isoxazol-3-ylamino)methyl)oxazolidin-2-one::CHEMBL233226
SMILES Cc1cc(on1)-c1ccc(cc1F)N1C[C@H](CNc2ccon2)OC1=O
InChI Key InChIKey=RASQBUHDLSRYGI-LBPRGKRZSA-N
Data  1 KI
  Tab Delimited (TSV)   2D SDfile   Computed 3D by Vconf -m prep SDfile
Find this compound or compounds like it in BindingDB:
Activity Spreadsheet -- Enzyme Inhibition Constant Data from BindingDB
Found 1 hit for monomerid = 50292299
TargetAmine oxidase [flavin-containing] A(Homo sapiens (Human))
Astrazeneca R&D Boston
Curated by ChEMBL
LigandPNGBDBM50292299((5S)-3-(3-fluoro-4-(3-methylisoxazol-5-yl)phenyl)-...)
Affinity DataKi:  420nM. Assay description: Inhibition human liver MAOA activity
In DepthDetails ArticlePubMed