BDBM50293304 CHEMBL454806::O-(4-Ethoxybutyl)berbamine::O-(4-ethoxybutyl)-berbamine
SMILES CCOCCCCOc1ccc2C[C@H]3N(C)CCc4cc(OC)c(OC)c(Oc5cc6[C@H](Cc7ccc(Oc1c2)cc7)N(C)CCc6cc5OC)c34
InChI Key InChIKey=MHFFPFLMIZYTNJ-OIDHKYIRSA-N
Data  1 IC50
  Tab Delimited (TSV)   2D SDfile   Computed 3D by Vconf -m prep SDfile
Find this compound or compounds like it in BindingDB:
Activity Spreadsheet -- Enzyme Inhibition Constant Data from BindingDB
Found 1 hit for monomerid = 50293304
LigandPNGBDBM50293304(CHEMBL454806 | O-(4-Ethoxybutyl)berbamine | O-(4-e...)
Affinity DataIC50:  350nM. Assay description: Inhibition of calmodulin-dependent phosphodiesterase
In DepthDetails ArticlePubMed