BDBM50295745 1-(2-nitrophenylsulfonyl)-1H-pyrrolo[3,2-b]pyridine-6-carboxamide::1-[(2-NITROPHENYL)SULFONYL]-1H-PYRROLO[3,2-B]PYRIDINE-6-CARBOXAMIDE::CHEMBL561660
SMILES NC(=O)c1cnc2ccn(c2c1)S(=O)(=O)c1ccccc1[N+]([O-])=O
InChI Key InChIKey=USLOIFPDNUDIEG-UHFFFAOYSA-N
Data  2 IC50
PDB links: 1 PDB ID matches this monomer.
  Tab Delimited (TSV)   2D SDfile   Computed 3D by Vconf -m prep SDfile
Find this compound or compounds like it in BindingDB:
Activity Spreadsheet -- Enzyme Inhibition Constant Data from BindingDB
Found 2 hits for monomerid = 50295745
TargetHepatocyte growth factor receptor(Homo sapiens (Human))
Sichuan University
Curated by ChEMBL
LigandPNGBDBM50295745(1-(2-nitrophenylsulfonyl)-1H-pyrrolo[3,2-b]pyridin...)
Affinity DataIC50:  82nM. Assay description: Inhibition of human c-MET
TargetHepatocyte growth factor receptor(Homo sapiens (Human))
Sichuan University
Curated by ChEMBL
LigandPNGBDBM50295745(1-(2-nitrophenylsulfonyl)-1H-pyrrolo[3,2-b]pyridin...)
Affinity DataIC50:  82nM. Assay description: Inhibition of human recombinant His-tagged c-Met by TR-FRET assay