BDBM50298433 5-(5-((S)-2-amino-3-phenylpropoxy)pyridin-3-yl)-3-(furan-2-ylmethyl)indolin-2-one::CHEMBL575811
SMILES N[C@H](COc1cncc(c1)-c1ccc2NC(=O)C(Cc3ccco3)c2c1)Cc1ccccc1
InChI Key InChIKey=GGSHYVNRNBBHSC-BWDMCYIDSA-N
Data  1 IC50
  Tab Delimited (TSV)   2D SDfile   Computed 3D by Vconf -m prep SDfile
Find this compound or compounds like it in BindingDB:
Activity Spreadsheet -- Enzyme Inhibition Constant Data from BindingDB
Found 1 hit for monomerid = 50298433
TargetRAC-alpha serine/threonine-protein kinase(Homo sapiens (Human))
Zhejiang University
Curated by ChEMBL
LigandPNGBDBM50298433(5-(5-((S)-2-amino-3-phenylpropoxy)pyridin-3-yl)-3-...)
Affinity DataIC50:  1.40nM. Assay description: Inhibition of Akt
In DepthDetails ArticlePubMed