BDBM50298755 (5S,8S,11S,14S,17R)-11-(4-aminobutyl)-5,8-bis(hydroxymethyl)-14-isobutyl-7,19-dimethyl-3,6,9,12,15-pentaoxo-1-phenyl-2-oxa-4,7,10,13,16-pentaazaicosan-17-ylboronic acid::CHEMBL574698
SMILES CC(C)C[C@H](NC(=O)[C@H](CC(C)C)NC(=O)[C@H](CCCCN)NC(=O)[C@H](CO)N(C)C(=O)[C@H](CO)NC(=O)OCc1ccccc1)B(O)O
InChI Key InChIKey=LCUDUIPXENBYNK-IRGGMKSGSA-N
Data  1 KI
  Tab Delimited (TSV)   2D SDfile   Computed 3D by Vconf -m prep SDfile
Find this compound or compounds like it in BindingDB:
Activity Spreadsheet -- Enzyme Inhibition Constant Data from BindingDB
Found 1 hit for monomerid = 50298755
TargetProstate-specific antigen(Homo sapiens (Human))
The Johns Hopkins University School Of Medicine
Curated by ChEMBL
LigandPNGBDBM50298755((5S,8S,11S,14S,17R)-11-(4-aminobutyl)-5,8-bis(hydr...)
Affinity DataKi:  19.9nM. Assay description: Inhibition of prostate-specific antigen assessed as substrate hydrolysis by fluorescence assay
In DepthDetails ArticlePubMed