BDBM50299531 2,5-dimethoxy-4-methyl-N-(pyridin-3-yl)benzenesulfonamide::CHEMBL568091::cid_6471866
SMILES COc1cc(c(OC)cc1C)S(=O)(=O)Nc1cccnc1
InChI Key InChIKey=POIKSDXLSQAIPI-UHFFFAOYSA-N
Data  2 IC50
  Tab Delimited (TSV)   2D SDfile   Computed 3D by Vconf -m prep SDfile
Find this compound or compounds like it in BindingDB:
Activity Spreadsheet -- Enzyme Inhibition Constant Data from BindingDB
Found 2 hits for monomerid = 50299531
TargetAlkaline phosphatase, tissue-nonspecific isozyme(Homo sapiens (Human))
Institute For Medical Research
Curated by ChEMBL
LigandPNGBDBM50299531(2,5-dimethoxy-4-methyl-N-(pyridin-3-yl)benzenesulf...)
Affinity DataIC50:  1.49E+3nM. Assay description: Inhibition of TNAP transfected in african green monkey COS1 cells by colorimetric assay
In DepthDetails ArticlePubMed
TargetAlkaline phosphatase, tissue-nonspecific isozyme(Homo sapiens (Human))
Institute For Medical Research
Curated by ChEMBL
LigandPNGBDBM50299531(2,5-dimethoxy-4-methyl-N-(pyridin-3-yl)benzenesulf...)
Affinity DataIC50:  1.49E+3nM. Assay description: Sanford-Burnham Center for Chemical Genomics (SBCCG) Sanford-Burnham Medical Research Institute (SBMRI, San Diego, CA) NIH Molecular Libraries Screen...
In DepthDetails PCBioAssay