BDBM50300262 5-[2,3-Dichloro-4-(2-methylene-1-oxobutyl)phenoxymethyl]-3-phenyl-1,2,4-oxadiazole::CHEMBL571257
SMILES CCC(=C)C(=O)c1ccc(OCc2nc(no2)-c2ccccc2)c(Cl)c1Cl
InChI Key InChIKey=OPMAURBADQQBFW-UHFFFAOYSA-N
Data  1 IC50
  Tab Delimited (TSV)   2D SDfile   Computed 3D by Vconf -m prep SDfile
Find this compound or compounds like it in BindingDB:
Activity Spreadsheet -- Enzyme Inhibition Constant Data from BindingDB
Found 1 hit for monomerid = 50300262
TargetGlutathione S-transferase P(Homo sapiens (Human))
Shandong University
Curated by ChEMBL
LigandPNGBDBM50300262(5-[2,3-Dichloro-4-(2-methylene-1-oxobutyl)phenoxym...)
Affinity DataIC50:  3.60E+3nM. Assay description: Inhibition of GST P1-1 in human HL60 cell lysate
In DepthDetails ArticlePubMed