BDBM50300264 5-[2,3-Dichloro-4-(2-methylene-1-oxobutyl)phenoxymethyl]-3-(4-trifluoromethylphenyl)-1,2,4-oxadiazol::CHEMBL576873
SMILES CCC(=C)C(=O)c1ccc(OCc2nc(no2)-c2ccc(cc2)C(F)(F)F)c(Cl)c1Cl
InChI Key InChIKey=PMKSZDLEVDAOOC-UHFFFAOYSA-N
Data  1 IC50
  Tab Delimited (TSV)   2D SDfile   Computed 3D by Vconf -m prep SDfile
Find this compound or compounds like it in BindingDB:
Activity Spreadsheet -- Enzyme Inhibition Constant Data from BindingDB
Found 1 hit for monomerid = 50300264
TargetGlutathione S-transferase P(Homo sapiens (Human))
Shandong University
Curated by ChEMBL
LigandPNGBDBM50300264(5-[2,3-Dichloro-4-(2-methylene-1-oxobutyl)phenoxym...)
Affinity DataIC50: >4.00E+4nM. Assay description: Inhibition of GST P1-1 in human HL60 cell lysate
In DepthDetails ArticlePubMed