BDBM50300681 2-(4-methoxyphenyl)-5-methyl-2H-pyrazolo[4,3-d]pyrimidin-7(6H)-one::CHEMBL574132
SMILES COc1ccc(cc1)-n1cc2nc(C)[nH]c(=O)c2n1
InChI Key InChIKey=BURSTMOEAKWKJZ-UHFFFAOYSA-N
Data  2 KI
  Tab Delimited (TSV)   2D SDfile   Computed 3D by Vconf -m prep SDfile
Find this compound or compounds like it in BindingDB:
Activity Spreadsheet -- Enzyme Inhibition Constant Data from BindingDB
Found 2 hits for monomerid = 50300681
TargetAdenosine receptor A3(Homo sapiens (Human))
Universit£
Curated by ChEMBL
LigandPNGBDBM50300681(2-(4-methoxyphenyl)-5-methyl-2H-pyrazolo[4,3-d]pyr...)
Affinity DataKi:  1.20nM. Assay description: Displacement of [125I]AB-MECA from human cloned adenosine A3 receptor expressed in CHO cells after 120 mins by scintillation counting
In DepthDetails ArticlePubMed
TargetAdenosine receptor A3(Homo sapiens (Human))
Universit£
Curated by ChEMBL
LigandPNGBDBM50300681(2-(4-methoxyphenyl)-5-methyl-2H-pyrazolo[4,3-d]pyr...)
Affinity DataKi:  5.20nM. Assay description: Antagonist activity at human cloned adenosine A3 receptor expressed in CHO cells assessed as inhibition of Cl-IB-MECA-inhibited [3H]cAMP production b...
In DepthDetails ArticlePubMed