BDBM50300824 2-{3-[(3-Chlorophenyl)sulfonyl]-1H-pyrrolo[2,3-b]pyridin-1-yl}ethylamine::CHEMBL565745
SMILES NCCn1cc(c2cccnc12)S(=O)(=O)c1cccc(Cl)c1
InChI Key InChIKey=XGXHANFTDNWBFA-UHFFFAOYSA-N
Data  1 KI  5 IC50  1 EC50
  Tab Delimited (TSV)   2D SDfile   Computed 3D by Vconf -m prep SDfile
Find this compound or compounds like it in BindingDB:
Activity Spreadsheet -- Enzyme Inhibition Constant Data from BindingDB
Found 7 hits for monomerid = 50300824
Target5-hydroxytryptamine receptor 6(Homo sapiens (Human))
Wyeth Research
Curated by ChEMBL
LigandPNGBDBM50300824(2-{3-[(3-Chlorophenyl)sulfonyl]-1H-pyrrolo[2,3-b]p...)
Affinity DataKi:  2nM. Assay description: Displacement of [3H]LSD from human cloned 5HT6 receptor expressed in HeLa cells
In DepthDetails ArticlePubMed
TargetD(4) dopamine receptor(Homo sapiens (Human))
Wyeth Research
Curated by ChEMBL
LigandPNGBDBM50300824(2-{3-[(3-Chlorophenyl)sulfonyl]-1H-pyrrolo[2,3-b]p...)
Affinity DataIC50: >5.00E+3nM. Assay description: Displacement of [3H]spiperone from human cloned dopamine D4 receptor expressed in CHO-K1 cells
In DepthDetails ArticlePubMed
Target5-hydroxytryptamine receptor 7(Homo sapiens (Human))
Wyeth Research
Curated by ChEMBL
LigandPNGBDBM50300824(2-{3-[(3-Chlorophenyl)sulfonyl]-1H-pyrrolo[2,3-b]p...)
Affinity DataIC50:  1.36E+3nM. Assay description: Displacement of [3H]LSD from human cloned 5HT7 receptor expressed in CHO cells
In DepthDetails ArticlePubMed
Target5-hydroxytryptamine receptor 2A(Homo sapiens (Human))
Wyeth Research
Curated by ChEMBL
LigandPNGBDBM50300824(2-{3-[(3-Chlorophenyl)sulfonyl]-1H-pyrrolo[2,3-b]p...)
Affinity DataIC50:  11nM. Assay description: Displacement of [125I]DOI from human cloned 5HT2A receptor expressed in CHO cells
In DepthDetails ArticlePubMed
Target5-hydroxytryptamine receptor 6(Homo sapiens (Human))
Wyeth Research
Curated by ChEMBL
LigandPNGBDBM50300824(2-{3-[(3-Chlorophenyl)sulfonyl]-1H-pyrrolo[2,3-b]p...)
Affinity DataEC50:  18nM. Assay description: Agonist activity at human cloned 5HT6 receptor expressed in HeLa cells assessed as induction of adenylyl cyclase activity by RIA
In DepthDetails ArticlePubMed
Target5-hydroxytryptamine receptor 2C(Homo sapiens (Human))
Wyeth Research
Curated by ChEMBL
LigandPNGBDBM50300824(2-{3-[(3-Chlorophenyl)sulfonyl]-1H-pyrrolo[2,3-b]p...)
Affinity DataIC50:  44nM. Assay description: Displacement of [3H]5-HT from human cloned 5HT2C receptor expressed in CHO cells
In DepthDetails ArticlePubMed
TargetD(3) dopamine receptor(Homo sapiens (Human))
Wyeth Research
Curated by ChEMBL
LigandPNGBDBM50300824(2-{3-[(3-Chlorophenyl)sulfonyl]-1H-pyrrolo[2,3-b]p...)
Affinity DataIC50: >5.00E+3nM. Assay description: Displacement of [3H]spiperone from human cloned dopamine D3 receptor expressed in CHO-K1 cells
In DepthDetails ArticlePubMed